Line intercept sampling
type: Concept
change note: 2017-06-28 07:39:33.0 [tstevens] insert AltLabel (id: null category: primary text: Line intercept sampling language code: en); insert Definition (id: null text: Line intercept sampling is a method of sampling elements in a region whereby an element is sampled if a chosen line segment, called a "transect", intersects the element. Line intercept sampling has proven to be a reliable, versatile, and easy to implement method to analyze an area containing various objects of interest. language code: en);
change note: 2017-06-28 07:39:11.0 [tstevens] Insert Concept add broader relation (Line intercept sampling [814d6fe0-07c4-4af1-b8ce-85348cb119a6,309725] - Environmental Modeling [ded4f1ec-01bc-4e96-99bb-1a7464af9e46,291489]);
definition: Line intercept sampling is a method of sampling elements in a region whereby an element is sampled if a chosen line segment, called a "transect", intersects the element. Line intercept sampling has proven to be a reliable, versatile, and easy to implement method to analyze an area containing various objects of interest.
in scheme: instruments

Environmental Modeling
type: Concept