Interferometers
type: Concept

HIS
type: Concept
definition: The High resolution Interferometer Sounder (HIS) is an airborne interferometer that measures emitted thermal radiation at high spectral resolution to obtain atmospheric profiles, including temperature and water vapor. [Source: University of Wisconsin-Madison]
in scheme: instruments