SEAMOUNTS
type: Concept
definition: Isolated steep-sided volcanic peak that rises abruptly at least 1000 m from the sea floor, sometimes piercing the surface to become islands.
in scheme: sciencekeywords

BATHYMETRY/SEAFLOOR TOPOGRAPHY
type: Concept