TROPICAL/NORTHERN HEMISPHERE PATTERN
type: Concept
change note: 2020-02-18 09:02:06.0 [tstevens] Remove Concepts delete narrower relation (null);
change note: 2012-07-09 12:29:46.0 [mpmorahan] insert Definition (id: null text: The Tropical/ Northern Hemisphere pattern was first classified by Mo and Livezey (1986), and appears as a prominent mode from November-February. The pattern consists of one primary anomaly center over the Gulf of Alaska and a separate anomaly center of opposite sign over the Hudson Bay. A weaker area of anomalies having similar sign to the Gulf of Alaska anomaly extends across Mexico and the extreme southeastern United States. This pattern reflects large-scale changes in both the location and eastward extent of the Pacific jet stream, and also in the strength and position of the climatological mean Hudson Bay Low. Thus, the pattern significantly modulates the flow of marine air into North America, as well as the southward transport of cold Canadian air into the north-central United States. language code: en);
change note: 2012-06-25 11:55:23.0 [mpmorahan] Insert Concept add narrower relation (TROPICAL/NORTHERN HEMISPHERE PATTERN [83b711e1-3fb5-4ef3-bafb-783e8239a4b5,22933] - TNH [8eac6c91-8af5-4b1b-8dc3-89cd4871915f,39741]);
definition: The Tropical/ Northern Hemisphere pattern was first classified by Mo and Livezey (1986), and appears as a prominent mode from November-February. The pattern consists of one primary anomaly center over the Gulf of Alaska and a separate anomaly center of opposite sign over the Hudson Bay. A weaker area of anomalies having similar sign to the Gulf of Alaska anomaly extends across Mexico and the extreme southeastern United States. This pattern reflects large-scale changes in both the location and eastward extent of the Pacific jet stream, and also in the strength and position of the climatological mean Hudson Bay Low. Thus, the pattern significantly modulates the flow of marine air into North America, as well as the southward transport of cold Canadian air into the north-central United States.
in scheme: sciencekeywords

TELECONNECTIONS
type: Concept