GLACIAL MEASUREMENTS
type: Concept

Hypsometry
type: Concept

GLACIER ELEVATION/ICE SHEET ELEVATION
type: Concept
change note: 2012-06-26 13:23:29.0 [gee-cee] Insert Concept add broader relation (GLACIER ELEVATION/ICE SHEET ELEVATION [83bd640d-cd05-49a8-9ec7-aab60820b126,39909] - GLACIAL MEASUREMENTS [2d79af4f-d15f-40cc-b0bf-8f5c8eb1fce5,39907]);
change note: 2021-12-02 14:56:36.0 [sritz] Insert Concept add narrower relation (GLACIER ELEVATION/ICE SHEET ELEVATION [83bd640d-cd05-49a8-9ec7-aab60820b126,834215] - Hypsometry [6a2b291c-f78b-48c3-869f-9a4c8a40bc6c,835960]);
change note: 2012-07-10 10:40:26.0 [mpmorahan] insert Definition (id: null text: Pertaining to the measured height of large thick, glaciers, with an area of at least 50,000 sq. km, covering a continuous stretch of land and growing in all directions. language code: en);
definition: Pertaining to the measured height of large thick, glaciers, with an area of at least 50,000 sq. km, covering a continuous stretch of land and growing in all directions.
in scheme: sciencekeywords