KNB
type: Concept
definition: We have added a list of sites using KNB software. • We are now accepting nominations for the inclusion of particularly valuable ecological data sets within the KNB. • Slides are available for the Second KNB Data Management Tools Workshop, which was held February 2-4, 2005. • Slides are available for the First KNB Data Management Tools Workshop, which was held September 28-30, 2004. Summary Provided By: http://knb.ecoinformatics.org/index.jsp
in scheme: providers

CONSORTIA/INSTITUTIONS
type: Concept