Earth Observation Satellites
type: Concept

THEOS
type: Concept
change note: 2021-11-30 09:33:32.0 [tstevens] Move Concepts delete broader relation (null); add broader relation (THEOS [84ddaf4a-fe17-4f01-becf-8164ae255b73,826453] - Earth Observation Satellites [3466eed1-2fbb-49bf-ab0b-dc08731d502b,826121]);
change note: 2021-11-18 12:41:31.0 [tstevens] Move Concepts delete broader relation (null); add broader relation (THEOS [84ddaf4a-fe17-4f01-becf-8164ae255b73,826453] - Space-based Platforms [b39a69b4-c3b9-4a94-b296-bbbbe5e4c847,835875]);
definition: The THEOS contract with the Thai Ministry of Science and Technology's Space Agency (GISTDA) includes the production and launch of one optical observation satellite, as well as the development of the ground segment necessary to operate and control the satellite directly from Thailand. This is accompanied by state of the art facilities for image archiving and processing. The THEOS satellite is based on EADS Astrium's new generation of high performance AstroSat optical Earth observation satellites and benefits from the company's extensive experience in this field which started with the SPOT and MetOp satellites. As part of the THEOS contract, Thai engineers will join the Astrium development team and attend intensive space programme training. The company firmly believes that this cooperation contract paves the way for further development of GISTDA and space activities in Thailand. The THEOS payload features both high resolution in panchromatic mode (2m) and wide field of view in multi-spectral mode and has been tailored to Thailand's specific needs with a worldwide imaging capability. It will be launched in 2008 on a sun synchronous orbit at an altitude of around 820km. THEOS will be fully owned and operated by GISTDA and will provide Thailand with worldwide geo-referenced image products and image processing capabilities for applications in cartography, land use, agricultural monitoring, forestry management, coastal zone monitoring and flood risk management. THEOS will provide access to any part of Thailand in less than two days. [Source: EADS Astrium Home Page, http://www.astrium.eads.net/families/daily-life-benefits/remote-sensing/theos ] Group: Platform_Details Entry_ID: THEOS Group: Platform_Identification Platform_Category: Earth Observation Satellites Short_Name: THEOS Long_Name: Thai Earth Observation System End_Group Group: Platform_Associated_Instruments Short_Name: MS Short_Name: PAN End_Group Group: Orbit Orbit_Altitude: 822 km Orbit_Inclination: 98.7 Equator…
in scheme: platforms