WESTERN REGION
type: Concept

WR/WRCC
type: Concept
definition: The Western Regional Climate Center (WRCC) is a Three-Partner National Climate Services Program - the Partners Include: National Climatic Data Center (NCDC), Regional Climate Centers (RCC's), and State Climate Offices. Website: "http://www.wrcc.dri.edu/" [Summary provided by the WRCC]
in scheme: providers