CA/NRCAN/ESS/GC/CCRS/GEO
type: Concept
definition: The Geomatics Development program was is an initiative of the GeoAccess Division, of the Canada Centre for Remote Sensing, Natural Resources Canada. It was a continuation of the Geographic Information Systems Development program (GISDP), which started in 1994. Summary Provided by: http://www.ccrs.nrcan.gc.ca/org/programs/gdp_e.php
in scheme: providers

CANADA
type: Concept