MULTINATIONAL ORGANIZATIONS
type: Concept

IUCN
type: Concept
change note: 2013-04-04 09:11:27.0 [tbs1979] Insert Concept add broader relation (IUCN [872b4436-adf6-40b1-86a3-8d46454c5daa,83253] - MULTINATIONAL ORGANIZATIONS [756a90f8-4203-46f1-87e9-9e0d64bdee50,66455]);
definition: The International Union for Conservation of Nature (IUCN) is the world’s oldest and largest global environmental organization. The IUCN works on hundreds of projects, initiatives and activities around the world. All of the work is framed by a Global Programme, developed with and approved by IUCN Member organizations every four years at the IUCN World Conservation Congress. The IUCN Programme, with clear objectives and areas of activity, is coordinated by IUCN’s Secretariat and delivered in conjunction with IUCN member organizations and Commissions.
in scheme: providers