MINES ParisTech
type: Concept
change note: 2014-05-09 07:58:51.0 [128.183.164.42] insert AltLabel (id: null text: MINES ParisTech language code: en);
change note: 2014-05-09 07:56:41.0 [128.183.164.42] Insert Concept add broader relation (MINES ParisTech [873477b6-8269-4f31-912e-d326a6e00f10,106363] - CONSORTIA/INSTITUTIONS [aef2fc80-def0-46a4-9259-9dc37e80ed08,66451]);
definition: MINES ParisTech is one of the most prominent French engineering schools and a prestigious member of ParisTech (Paris Institute of Technology) and PSL* (Paris Sciences et Lettres).
in scheme: providers

CONSORTIA/INSTITUTIONS
type: Concept