ATMOSPHERIC/OCEAN INDICATORS
type: Concept

OCEAN UPWELLING/DOWNWELLING
type: Concept
change note: 2012-07-05 13:15:59.0 [mpmorahan] insert Definition (id: null text: The upward motion of seawater anywhere in the oceans. language code: en);
change note: 2012-06-26 10:41:43.0 [gee-cee] Insert Concept add broader relation (OCEAN UPWELLING/DOWNWELLING [873ed434-9407-4fd8-9660-41e50b0eb786,39823] - ATMOSPHERIC/OCEAN INDICATORS [5273c8c2-d30b-4666-b2d5-0388ce2741d0,39645]);
definition: The upward motion of seawater anywhere in the oceans.
in scheme: sciencekeywords