OCEAN HEAT BUDGET
type: Concept

EVAPORATION
type: Concept
definition: The physical process by which a liquid is transformed to the gaseous state. Evaporation also implies a loss of heat from the ocean surface and is an important term in determining the heat budget of the ocean.
in scheme: sciencekeywords