CRUSTAL MOTION RATE
type: Concept
change note: 2013-04-02 09:15:16.0 [tbs1979] insert Definition (id: null text: The speed at which the earth's crust is moving. language code: en);
change note: 2013-03-08 13:19:29.0 [tbs1979] Insert Concept add broader relation (CRUSTAL MOTION RATE [88a6ed54-6504-4787-9d98-d511d4f4ae83,83185] - CRUSTAL MOTION [8dd8d272-fb6d-4eec-882a-f3be98800b42,83183]);
definition: The speed at which the earth's crust is moving.
in scheme: sciencekeywords

CRUSTAL MOTION
type: Concept