DOC/NOAA/NWS/NCEP-CFSR
type: Concept
definition: The NCEP Climate Forecast System version 2 was developed at the Environmental Modeling Center at NCEP. It is a fully coupled model representing the interaction between the Earth's oceans, land and atmosphere. It became operational at NCEP in March 2011.
in scheme: providers

NOAA
type: Concept