DUNES
type: Concept

DOME DUNE
type: Concept
change note: 2013-08-20 08:55:50.0 [tbs1979] insert Definition (id: null text: Oval or circular mounds that generally lack a slipface, dome dunes are rare, and these occur at the far upwind margins of sand seas. language code: en); update PrefLabel (DOME DUNE);
change note: 2013-08-06 08:13:50.0 [tbs1979] Insert Concept add broader relation (DOME [8971f15d-bee3-4eaf-a7dd-ceb005448b37,105517] - DUNES [362993fc-743e-42bc-a011-459baea8f427,105509]);
definition: Oval or circular mounds that generally lack a slipface, dome dunes are rare, and these occur at the far upwind margins of sand seas.
in scheme: sciencekeywords