FORESTS
type: Concept

TROPICAL RAINFOREST
type: Concept
change note: 2016-06-13 12:12:41.0 [gee-cee] insert Definition (id: null text: Pertaining to forests in tropical latitudes characterized by high annual precipitation consisting of dense vegetation divided into three distinct layers. language code: en);
change note: 2016-06-13 12:11:50.0 [gee-cee] Insert Concept add broader relation (TROPICAL RAINFOREST [89bb4e2b-dd39-44ed-a4d3-2b205e9fa68a,188185] - FORESTS [46e4aaa4-349c-4049-a910-035391360010,83507]);
definition: Pertaining to forests in tropical latitudes characterized by high annual precipitation consisting of dense vegetation divided into three distinct layers.
in scheme: sciencekeywords