S - U
type: Concept

UK CLIMATE RESEARCH PROGRAMME
type: Concept
definition: Climate Change is a global issue and the Met Office Hadley Centre is leading international research into what could happen under climate change, and the impacts on current and future generations. Summary Provided By: http://www.metoffice.gov.uk/research/hadleycentre/
in scheme: projects