PALEOCLIMATE RECONSTRUCTIONS
type: Concept

AIR TEMPERATURE RECONSTRUCTION
type: Concept
change note: 2012-07-26 10:50:39.0 [mpmorahan] insert Definition (id: null text: Reconstruction of past air temperatures using paleoclimate proxy records. language code: en);
change note: 2012-06-27 08:36:15.0 [mpmorahan] Insert Concept add broader relation (AIR TEMPERATURE RECONSTRUCTION [89e5b8c9-ef72-4e21-83c8-a7552f6871a4,40151] - PALEOCLIMATE RECONSTRUCTIONS [6f6423e8-ab4e-4572-8982-d9c40f64e28b,40149]);
definition: Reconstruction of past air temperatures using paleoclimate proxy records.
in scheme: sciencekeywords