COMMERCIAL
type: Concept

TELEMOR
type: Concept
definition: Telemorphic, Inc. is a leading innovator in web-based mapping products and services. We leverage rapidly convergent communications and computing technologies (C3T) to improve functionality, reduce costs, and add value for our customers. Through integration of technologies such as wireless telecommunications and internet, handheld devices, GPS, satellite remote sensing imagery, and digital map information, we offer enhanced mobile and desktop geospatial products and services. Maplicity(tm) is Telemorphic’s flagship product in a suite of Java-based tools for development and deployment of custom clients for ESRI's ArcIMS. Maplicity offers an intuitive, highly interactive, and configurable web browser-based GUI to ArcIMS. Current add-ons products include MapImager(tm), which provides advanced image analysis tools for ESRI's ArcIMS. Telemorphic, Inc. is also an ESRI Business Partner (authorized ArcIMS Developer and Reseller). Summary Provided by: http://www.directionsmag.com/companies/Telemorphic,_Inc./
in scheme: providers