GNSS RECEIVER
type: Concept
change note: 2021-08-05 12:09:02.0 [sritz] insert AltLabel (id: null category: primary text: GNSS RECEIVER language code: en);
change note: 2017-08-15 10:07:56.0 [tstevens] insert Definition (id: null text: GNSS receivers detect, decode, and process signals from the GNSS satellites. The satellites transmit the ranging codes on two radio-frequency carriers, allowing the locations of GNSS receivers to be determined with varying degrees of accuracy, depending on the receiver and post-processing of the data. language code: en);
change note: 2017-08-14 15:38:11.0 [tstevens] Insert Concept add broader relation (GNSS RECEIVER [8a6adca1-c79e-44fd-9ae8-b466ae4d51d9,309959] - Galileo [bf71449f-834e-4183-9006-cf94f7eb5520,309955]);
definition: GNSS receivers detect, decode, and process signals from the GNSS satellites. The satellites transmit the ranging codes on two radio-frequency carriers, allowing the locations of GNSS receivers to be determined with varying degrees of accuracy, depending on the receiver and post-processing of the data.
in scheme: instruments

Galileo
type: Concept