Chemical Meters/Analyzers
type: Concept

MetOne BAM 1020
type: Concept
change note: 2021-05-12 09:03:12.0 [tstevens] insert AltLabel (id: null category: primary text: MetOne BAM 1020 Continuous Particulate Monitor language code: en); insert Definition (id: null text: The BAM 1020 automatically measures and records airborne particulate concentration levels (in milligrams or micrograms per cubic meter) using the industry-proven principle of beta ray attenuation. Thousands of BAM 1020 units are currently deployed worldwide, making the unit one of the most successful air monitoring platforms in the world. language code: en);
change note: 2021-05-12 09:02:11.0 [tstevens] Insert Concept add broader relation (MetOne BAM 1020 [8b176d9b-4831-44a7-bec2-516ec9246f5b,606929] - Chemical Meters/Analyzers [3d25724b-832f-4a61-b0b2-4f2ccecdba94,598603]);
definition: The BAM 1020 automatically measures and records airborne particulate concentration levels (in milligrams or micrograms per cubic meter) using the industry-proven principle of beta ray attenuation. Thousands of BAM 1020 units are currently deployed worldwide, making the unit one of the most successful air monitoring platforms in the world.
in scheme: instruments