ATOLL REEF
type: Concept
change note: 2013-08-20 08:46:14.0 [tbs1979] insert Definition (id: null text: A ring-shaped coral reef including a coral rim that encircles a lagoon partially or completely. There may be coral islands/cays on the coral rim. language code: en);
change note: 2013-08-06 08:10:52.0 [tbs1979] Insert Concept add broader relation (ATOLL REEF [8bbf1177-c74b-4f11-8f7d-40c5785312a1,105501] - CORAL REEFS [c6244bfb-300f-4818-bf45-cf1a15e7e073,105487]);
definition: A ring-shaped coral reef including a coral rim that encircles a lagoon partially or completely. There may be coral islands/cays on the coral rim.
in scheme: sciencekeywords

CORAL REEFS
type: Concept