Permanent Land Sites
type: Concept

Vaisala WXT520
type: Concept
change note: 2021-08-10 14:04:16.0 [tstevens] insert AltLabel (id: null category: primary text: Vaisala Weather Transmitter WXT520 language code: en); insert Definition (id: null text: Weather Transmitter WXT520 is a small and lightweight transmitter that offers six weather parameters in one compact package. WXT520 measures wind speed and direction, precipitation, atmospheric pressure, temperature and relative humidity. The transmitter housing is IP65/IP66 rated. WXT520 powers up with 5 ... 32 VDC and outputs serial data with a selectable communication protocol: SDI-12, ASCII automatic & polled and NMEA 0183 with query option. Four alternative serial interfaces are selectable: RS-232, RS-485, RS-422, and SDI-12. The transmitter is equipped with a 8-pin M12 connector for installation, and a 4-pin M8 connector for service use. language code: en);
change note: 2021-08-10 14:01:40.0 [tstevens] Insert Concept add broader relation (Vaisala WXT520 [8c17b0a9-ae57-4aee-8c6b-8e7020513cc2,706577] - WEATHER STATIONS/NETWORKS [57b7373d-5c21-4abb-8097-a410adc2a074,697100]);
change note: 2021-11-18 08:27:06.0 [tstevens] Move Concepts delete broader relation (null); add broader relation (Vaisala WXT520 [8c17b0a9-ae57-4aee-8c6b-8e7020513cc2,826490] - Permanent Land Sites [0ec10fd9-492c-498a-b6d8-e2840cc3643b,835887]);
definition: Weather Transmitter WXT520 is a small and lightweight transmitter that offers six weather parameters in one compact package. WXT520 measures wind speed and direction, precipitation, atmospheric pressure, temperature and relative humidity. The transmitter housing is IP65/IP66 rated. WXT520 powers up with 5 ... 32 VDC and outputs serial data with a selectable communication protocol: SDI-12, ASCII automatic & polled and NMEA 0183 with query option. Four alternative serial interfaces are selectable: RS-232, RS-485, RS-422, and SDI-12. The transmitter is equipped with a 8-pin M12 connector for installation, and a 4-pin M8 connector for service use.
in scheme: platforms