Chemical Meters/Analyzers
type: Concept

AEROSOL MONITOR
type: Concept
definition: The aerosol monitor measures mass concentrations of airborne dust, smoke, mists, haze, and fumes and provides continuous real-time readouts.
in scheme: instruments