GAS HYDRATES PHYSICAL/OPTICAL PROPERTIES
type: Concept

COMPOSITION/TEXTURE
type: Concept
change note: 2013-03-13 13:16:43.0 [tbs1979] insert Definition (id: null text: An analysis of the composition and texture of gas hydrates within the solid Earth. language code: en);
change note: 2013-03-05 10:20:31.0 [tbs1979] Insert Concept add broader relation (COMPOSITION/TEXTURE [8d396c19-6c45-44f6-9b59-53e1c3712622,82919] - GAS HYDRATES PHYSICAL/OPTICAL PROPERTIES [1f76b928-d41a-4fbd-9da7-b8602f0183bd,82915]);
definition: An analysis of the composition and texture of gas hydrates within the solid Earth.
in scheme: sciencekeywords