CUTBANK
type: Concept
change note: 2013-04-01 08:35:32.0 [tbs1979] insert Definition (id: null text: Also known as a river cliff, is an erosional feature of streams. Cut banks are found in abundance along mature or meandering streams, they are located on the outside of a stream bend, known as a meander. language code: en);
change note: 2013-02-18 10:34:11.0 [tbs1979] Insert Concept add broader relation (CUTBANK [8dcff6c3-a6b3-479e-96e2-63191d10ac2d,82431] - FLUVIAL LANDFORMS [cb5193ab-2d7a-4b35-b7ec-f16ce78ae270,64131]);
definition: Also known as a river cliff, is an erosional feature of streams. Cut banks are found in abundance along mature or meandering streams, they are located on the outside of a stream bend, known as a meander.
in scheme: sciencekeywords

FLUVIAL LANDFORMS
type: Concept