P - R
type: Concept

PCCI-BMBF
type: Concept
definition: Alongside Brazil, Chile and Mexico, Argentina is one of the Latin American countries with which Germany has been engaging in bilateral scientific and technological cooperation for many years. The 1969 intergovernmental agreement between Germany and Argentina forms the basis of bilateral cooperation in science and technology. Our cooperation partner in Argentina is the Ministry of Science, Technology and Productive Innovation (MINCyT), which was established in November 2007. For more information, visit: http://www.bmbf.de/en/5307.php
in scheme: projects