COMMERCIAL
type: Concept

PCIG
type: Concept
definition: Founded in 1982, PCI Geomatics is a world-leading, innovative developer of image-centric software for the geospatial industry. Specializing in remote sensing, digital photogrammetry, spatial analysis, map production and automated production systems, PCI Geomatics’ technology turns images into information. Our geospatial solutions enable our customers to find answers to real-world questions using satellite, aerial and other geospatial data. Summary Provided By: http://www.pcigeomatics.com/company/corporate_overview.html
in scheme: providers