WEATHER/CLIMATE ADVISORIES
type: Concept

DUST/ASH ADVISORIES
type: Concept
definition: Advisories providing reports of current volcanic ash plumes or dust clouds and the projected trajectory of the ash or dust.
in scheme: sciencekeywords