IT/CNR/IBIMET
type: Concept
definition: The institute of Biometeorology was founded in 2000, when within the National Researcher Council reorganization process, the institutes IATA (l'Istituto per l'Agrometeorologia e l'Analisi Ambientale applicata all'Agricoltura) of Florence, ISTEA (Istituto di Ecofisiologia delle piante Arboree da frutto) of Bologna and IMAES (Istituto per il Monitoraggio degli Agrosistemi) of Sassari were merged into a single institute. The old institutes keep their territorial role as Section. Florence Section is the IBIMET headquarter. Additional information can be found at "http://www.ibimet.cnr.it/"
in scheme: providers

ITALY
type: Concept