ICOMM
type: Concept
definition: Building a cyberinfrastructure to index and organize what is known about microbes, the world's smallest organisms, which account for 90 percent of biomass in oceans. The oceans worldwide are teeming with microbial life forms invisible to the naked eye. An estimated 3.6 x 1030 microbial cells of untold diversity account for > 90% of the total oceanic biomass. The number of viral particles may be one hundred fold greater. Rich, chemosynthetic microbial communities thrive at deep-sea hydrothermal vents. Abundant archaea, one of the two prokaryotic domains of life, populate oceanic midwaters. Very large populations of phytoplankton including diatoms, dinoflagellates, picoflagellates and cyanobacteria, the primary catalysts in carbon fixation, orchestrate the cycling of nitrogen and form the base of the traditional marine food web. The heterotrophic bacteria belonging to the SAR11 group dominate communities of ocean-surface bacterioplankton while nonphotosynthetic protists (usually single-cell eukaryotes) of unknown diversity control the size of picoplankton (plankton less than 2 µm) populations and regulate the supply of nutrients into the ocean's food webs. Microbes account for the preponderance of life's genetic and metabolic variation, but our understanding of microbial diversity and the evolution of its population structures in the oceans is only fragmentary. The International Census of Marine Microbes (ICoMM) will facilitate the inventory of this microbial diversity developing a strategy to (1) catalogue all known diversity of single-cell organisms inclusive of the Bacteria, Archaea, Protista and associated viruses, (2) to explore and discover unknown microbial diversity, and (3) to place that knowledge into appropriate ecological and evolutionary contexts. Summary provided by http://www.coml.org/projects/international-census-marine-microbes-icomm
in scheme: projects

G - I
type: Concept