Current/Wind Meters
type: Concept

WIND VANES
type: Concept
change note: 2021-08-05 18:04:22.0 [sritz] insert AltLabel (id: null category: primary text: WIND VANES language code: en);
definition: WIND VANES are instruments used to indicate or measure wind direction; consists of an asymmetrical, elongated object mounted at its center of gravity about a vertical axis; wind direction is determined by visual reference to an attached oriented compass rose.
in scheme: instruments