COMMERCIAL
type: Concept

HTHAEC
type: Concept
definition: Since 1970, H. T. Harvey & Associates has provided both public agencies and private companies with expert ecological consulting services. Their business mission is to furnish our clients with sound scientific information as the basis for making responsible decisions involving land use and resource management. They serve clients from the California offices in San Jose, Fresno, Sacramento, and Watsonville. While the majority of their work occurs in California, they also have projects in progress worldwide, ranging from Alaska?s Prince William Sound to Antarctica?s Ross Sea. Website: "http://www.harveyecology.com/" [Summary provided by H. T. Harvey & Associates]
in scheme: providers