OCEANS
type: Concept

HYDROGRAPHY
type: Concept
change note: 2021-10-19 08:27:41.0 [tstevens] insert Definition (id: null text: Mapping water depth and the shape of the seafloor. language code: en);
change note: 2021-10-19 08:26:29.0 [tstevens] Insert Concept add broader relation (HYDROGRAPHY [916b2963-6c1d-48ee-8f97-8606febf8db7,778188] - OCEANS [91697b7d-8f2b-4954-850e-61d5f61c867d,774817]);
definition: Mapping water depth and the shape of the seafloor.
in scheme: sciencekeywords