FEED STORAGE
type: Concept
definition: Any measure related to the storage of feed, and new methods for improved qualtiy over the long term, feed hopper types, etc...
in scheme: sciencekeywords

FEED PRODUCTS
type: Concept