Models
type: Concept

NCEP-CFSR
type: Concept
change note: 2015-08-10 14:54:18.0 [epneff] Insert Concept add broader relation (NCEP-CFSR [929347c6-e7d9-4e72-a6c8-8926a369cb6b,158247] - Models/Analyses [113ecbc2-ab36-4d58-a96c-a6ce0106e749,143215]);
change note: 2022-03-11 13:39:08.0 [tstevens] insert Definition (id: null text: The Climate Forecast System Reanalysis (CFSR) was an effort to generate a uniform, continuous, best-estimate record of the state of the ocean–atmosphere interaction for use in climate monitoring and diagnostics. The Climate Forecast System (CFS) models the interactions between Earth's oceans, land, and atmosphere on a global scale. The model is produced by several dozen scientists under guidance from the National Centers for Environmental Prediction (NCEP), and generates hourly data with a ½° horizontal resolution (approximately 56 km). language code: en);
change note: 2015-08-10 14:54:37.0 [epneff] Added long name insert AltLabel (id: null text: NCEP Climate Forecast System Reanalysis language code: en);
change note: 2021-11-30 13:29:58.0 [tstevens] Move Concepts delete broader relation (null); add broader relation (NCEP-CFSR [929347c6-e7d9-4e72-a6c8-8926a369cb6b,826509] - Models [0a184cdc-c074-4946-90a6-02f03c686341,835911]);
definition: The Climate Forecast System Reanalysis (CFSR) was an effort to generate a uniform, continuous, best-estimate record of the state of the ocean–atmosphere interaction for use in climate monitoring and diagnostics. The Climate Forecast System (CFS) models the interactions between Earth's oceans, land, and atmosphere on a global scale. The model is produced by several dozen scientists under guidance from the National Centers for Environmental Prediction (NCEP), and generates hourly data with a ½° horizontal resolution (approximately 56 km).
in scheme: platforms