Models
type: Concept

ECMWF ERA5
type: Concept
change note: 2021-09-16 15:23:27.0 [tstevens] insert AltLabel (id: null category: primary text: ECMWF ERA5 Atmospheric Reanalysis language code: en); insert Definition (id: null text: ERA5 provides hourly estimates of a large number of atmospheric, land and oceanic climate variables. The data cover the Earth on a 30km grid and resolve the atmosphere using 137 levels from the surface up to a height of 80km. ERA5 includes information about uncertainties for all variables at reduced spatial and temporal resolutions. language code: en);
change note: 2021-09-16 15:21:34.0 [tstevens] Insert Concept add broader relation (ECMWF ERA5 [931c9090-2136-458b-9047-943c25c65f3a,735199] - Models/Analyses [113ecbc2-ab36-4d58-a96c-a6ce0106e749,725412]);
change note: 2021-11-30 13:34:28.0 [tstevens] Move Concepts delete broader relation (null); add broader relation (ECMWF ERA5 [931c9090-2136-458b-9047-943c25c65f3a,826513] - Models [0a184cdc-c074-4946-90a6-02f03c686341,835911]);
definition: ERA5 provides hourly estimates of a large number of atmospheric, land and oceanic climate variables. The data cover the Earth on a 30km grid and resolve the atmosphere using 137 levels from the surface up to a height of 80km. ERA5 includes information about uncertainties for all variables at reduced spatial and temporal resolutions.
in scheme: platforms