CARBON AND HYDROCARBON COMPOUNDS
type: Concept

DICARBON MONOXIDE
type: Concept
change note: 2020-10-16 12:12:52.0 [sritz] Insert Concept add broader relation (DICARBON MONOXIDE [94863274-c0fc-4386-9bac-5b6f5d1b9d06,560739] - CARBON AND HYDROCARBON COMPOUNDS [19ab681c-bdd7-4793-bbdb-1ec498575314,83945]);
definition: Dicarbon monoxide (C2O) is a molecule that contains two carbon atoms and one oxygen atom. It is a linear molecule that, because of its simplicity, is of interest in a variety of areas. It is, however, so extremely reactive that it is not encountered in everyday life. It is classified as a cumulene and an oxocarbon.
in scheme: sciencekeywords