AMOEBOIDS
type: Concept

AMOEBAS
type: Concept
definition: The genus amoebae includes several protozoan species. Although, through the microscope it appears as a shapeless mass of cytoplasm surrounded by a thin membrane. Amoebae perform all of life's functions.
in scheme: sciencekeywords