WELD
type: Concept
definition: The Web-enabled Landsat Data (WELD) project is collaboration between the United States Geological Survey (USGS) Earth Resources Observation and Science (EROS) Center and academic partner South Dakota State University Geographic Information Science Center of Excellence (GIScCE). It is funded by NASA's Making Earth System Data Records for Use in Research Environments (MEaSUREs), with significant USGS cost sharing. http://landsat.usgs.gov/WELD.php
in scheme: projects

V - Z
type: Concept