Chemical Meters/Analyzers
type: Concept

LIQUID CHROMATOGRAPHS
type: Concept
change note: 2021-08-05 12:39:44.0 [sritz] insert AltLabel (id: null category: primary text: LIQUID CHROMATOGRAPHS language code: en);
definition: LIQUID CHROMATOGRAPHS are sensors that study or collect data from the liquid layers of the chromatosphere (solar atmosphere above the PHOTOSPHERE and beneath the transition region and the CORONA).
in scheme: instruments