CA/BC/SRM/CDC
type: Concept
change note: 2015-02-25 15:22:18.0 [epneff] Updated URL update Definition (The British Columbia Conservation Data Centre (CDC) systematically collects and disseminates information on the rare and endangered plant and animal communities of British Columbia. This information is compiled and maintained in a computerized database which provides a centralized and scientific source of information on the status, locations and level of protection of these rare organisms and ecosystems. More information: http://www.env.gov.bc.ca/cdc/);
definition: The British Columbia Conservation Data Centre (CDC) systematically collects and disseminates information on the rare and endangered plant and animal communities of British Columbia. This information is compiled and maintained in a computerized database which provides a centralized and scientific source of information on the status, locations and level of protection of these rare organisms and ecosystems. More information: http://www.env.gov.bc.ca/cdc/
in scheme: providers

CANADA
type: Concept