Earth Observation Satellites
type: Concept

IMAGE
type: Concept
definition: The IMAGE spacecraft was launched from Vandenberg AFB on March 25, 2000, at 20:34:43 UTC. IMAGE is the first satellite mission dedicated to imaging the Earth's magnetosphere, the region of space controlled by the Earth's magnetic field and containing extremely tenuous plasmas of both solar and terrestrial origin. Invisible to standard astronomical observing techniques, these populations of ions and electrons have traditionally been studied by means of localized measurements with charged particle detectors, magnetometers, and electric field instruments. Instead of such in-situ measurements, IMAGE employs a variety of imaging techniques to "see the invisible" and to produce the first comprehensive global images of the plasma populations in the inner magnetosphere. With these images, space scientists are able to observe, in a way never before possible, the large-scale dynamics of the magnetosphere and the interactions among its constituent plasma populations. Additional information available at "http://pluto.space.swri.edu/IMAGE/" Group: Platform_Details Entry_ID: IMAGE Group: Platform_Identification Platform_Category: Earth Observation Satellites Short_Name: IMAGE Long_Name: Imager for Magnetopause -to - Aurora Global Exploration End_Group Group: Synonymous_Platform_Names Short_Name: IMAGE End_Group Group: Platform_Associated_Instruments Short_Name: UVI End_Group Creation_Date: 2007-11-20 Online_Resource: http://image.gsfc.nasa.gov/ Sample_Image: http://image.gsfc.nasa.gov/image/image_launch_a5.jpg Group: Platform_Logistics Launch_Date: 2000-03-25 Launch_Site: Vandenberg Air Force Base, USA Primary_Sponsor: NASA End_Group End_Group
in scheme: platforms