A - C
type: Concept

CLIMMIG
type: Concept
change note: 2022-07-11 17:27:52.0 [sritz] insert AltLabel (id: null category: primary text: Climate Migration language code: en); insert Definition (id: null text: A collection of population and climate migration projections developed for the World Bank's Groundswell report series. language code: en);
change note: 2022-07-11 17:26:54.0 [sritz] Insert Concept add broader relation (CLIMMIG [95ad06b3-f97b-4ac8-965d-b5a86cf066c1,982057] - A - C [0c89f3f4-7ab1-43ce-89ee-795d35f0e30a,975038]);
definition: A collection of population and climate migration projections developed for the World Bank's Groundswell report series.
in scheme: projects