HYDROLOGIC REGIME
type: Concept
change note: 2020-05-11 11:15:12.0 [tstevens] Insert Concept add broader relation (HYDROLOGIC REGIME [9731faa4-b7ae-4ead-8f00-ff8ec89fd5f7,560085] - WATER BUDGET [f8702aed-a0ae-46f0-89eb-abde858bc6ac,560081]);
definition: Spatial and temporal variations of the components in a water budget.
in scheme: sciencekeywords

WATER BUDGET
type: Concept