COMMERCIAL
type: Concept

BPS
type: Concept
definition: Backhuys Publishers publish books in biological fields such as Algology, Entomology, Ichthyology, Malacology, Ornithology, Mammalogy, Botany, General marine biology, and Palaeontology. The online catalogue allows users to search books of interest by specific keywords. Our World Wide Web - pages also contain an electronic order form. Ordering by E-mail is also possible. Please include in every E-mail message your voice number, fax number and full postal address. Website: "http://www.euronet.nl/users/backhuys/"
in scheme: providers