IGNEOUS ROCK FORMATION
type: Concept
change note: 2013-03-13 14:08:19.0 [tbs1979] insert Definition (id: null text: Rock created by the solidification of molten magma. language code: en);
change note: 2013-03-05 10:29:04.0 [tbs1979] Insert Concept add broader relation (IGNEOUS ROCK FORMATION [984d4966-070d-4f8c-85e7-83bb0fd804a8,82945] - IGNEOUS ROCKS [e8d97ffd-2fd2-4989-88a7-9772fc9b7cd8,62085]);
definition: Rock created by the solidification of molten magma.
in scheme: sciencekeywords

IGNEOUS ROCKS
type: Concept