Earth Observation Satellites
type: Concept

OSTM/JASON-2
type: Concept
alternative label: JASON-2
change note: 2021-11-18 12:47:12.0 [tstevens] Move Concepts delete broader relation (null); add broader relation (OSTM/JASON-2 [987f0e52-e554-475a-b680-50df620a520e,826534] - Space-based Platforms [b39a69b4-c3b9-4a94-b296-bbbbe5e4c847,835875]);
change note: 2021-11-18 12:52:16.0 [tstevens] Move Concepts delete broader relation (null); add broader relation (OSTM/JASON-2 [987f0e52-e554-475a-b680-50df620a520e,826534] - Earth Observation Satellites [3466eed1-2fbb-49bf-ab0b-dc08731d502b,826121]);
change note: 2016-06-09 13:15:52.0 [epneff] added altLabel insert AltLabel (id: null text: JASON-2 language code: en);
change note: 2020-10-28 08:09:47.0 [tstevens] update AltLabel (Joint Altimetry Satellite Oceanography Network - 2); update Definition (The Ocean Surface Topography Mission (OSTM)/Jason-2 was a follow-on altimetric mission to the very successful TOPEX/Poseidon mission and Jason-1. It was a joint mission between NASA and CNES (French space agency). It launched 20 June 2008 and began data collection on 12 July 2008.);
change note: 2020-01-29 17:08:37.0 [sritz] update Definition (The Ocean Surface Topography Mission (OSTM)/Jason-2 was a follow-on altimetric mission to the very successful TOPEX/Poseidon mission and Jason-1. It was a joint mission between NASA and CNES (French space agency). It launched 20 June 2008 and began data collection on 12 July 2008. OSTM measured significant wave height, sigma naught (sigma0), dry and wet troposphere and ionosphere, which can be used to calculate sea surface height and anomalies and total electron content. https://podaac.jpl.nasa.gov/OSTM-JASON2 Group: Platform_Details Entry_ID: OSTM/JASON-2 Group: Platform_Identification Platform_Category: Earth Observation Satellites Short_Name: OSTM/JASON-2 End_Group Group: Platform_Associated_Instruments Short_Name: AMR Short_Name: POSEIDON-3 Short_Name: GPSP Short_Name: LRA Short_Name: DORIS End_Group Group: Orbit Orbit_Altitude: 1336 km Orbit_Inclination: 66 degrees Repeat_Cycle: 10 Day Orbit_Type: LEO > Low Earth Orbit > Polar Non-Sun-Synchronous End_Group Creation_Date: 2008-06-11 Online_Resource: https://sealevel.jpl.nasa.gov/missions/ostmjason2/ Online_Resource: https://www.nasa.gov/mission_pages/ostm/main/index.html Online_Resource: https://www.aviso.altimetry.fr/en/missions/current-missions/jason-2.html Group: Platform_Logistics Launch_Date: 2008-06-20 Launch_Site: Vandenberg Air Force Base, USA Design_Life: 3 Years Primary_Sponsor: USA/NASA Primary_Sponsor: USA/NOAA Primary_Sponsor: France/CNES Primary_Sponsor: EUMETSAT End_Group End_Group);
change note: 2020-10-06 09:24:25.0 [mmorahan] insert AltLabel (id: null category: primary text: Joint Altimetry Satellite Oceanography Network - 3 language code: en);
definition: The Ocean Surface Topography Mission (OSTM)/Jason-2 was a follow-on altimetric mission to the very successful TOPEX/Poseidon mission and Jason-1. It was a joint mission between NASA and CNES (French space agency). It launched 20 June 2008 and began data collection on 12 July 2008.
in scheme: platforms