MAGNAPROBE
type: Concept
change note: 2014-03-05 12:04:45.0 [saritz] Insert Concept add broader relation (MAGNAPROBE [99b75b86-1e64-4d48-a01f-aa0cc855a4ae,106197] - Probes [def72d78-3c2f-4f46-91e7-259a0e63e2de,74895]);
change note: 2014-03-05 12:11:36.0 [saritz] insert AltLabel (id: null text: MagnaProbe language code: en);
change note: 2014-03-05 12:18:51.0 [saritz] insert Definition (id: null text: The MagnaProbe was invented by two scientists, Jon Holmgren and Dr. Matthew Stur of Snow-Hydro. It consists of a rod that's approximately 1.5 meters in length. At the end of the probe is a white basket that rides on the top of the snowpack. At the top of the probe is a white control button. Pushing this button automatically records the snow-depth measurement, storing it in a data box that's housed in a small backpack. The MagnaProbe was invented by two scientists, Jon Holmgren and Dr. Matthew Stur of Snow-Hydro. It consists of a rod that's approximately 1.5 meters in length. At the end of the probe is a white basket that rides on the top of the snowpack. At the top of the probe is a white control button. Pushing this button automatically records the snow-depth measurement, storing it in a data box that's housed in a small backpack. The MagnaProbe was invented by two scientists, Jon Holmgren and Dr. Matthew Stur of Snow-Hydro. It consists of a rod that's approximately 1.5 meters in length. At the end of the probe is a white basket that rides on the top of the snowpack. At the top of the probe is a white control button. Pushing this button automatically records the snow-depth measurement, storing it in a data box that's housed in a small backpack. language code: en);
definition: The MagnaProbe was invented by two scientists, Jon Holmgren and Dr. Matthew Stur of Snow-Hydro. It consists of a rod that's approximately 1.5 meters in length. At the end of the probe is a white basket that rides on the top of the snowpack. At the top of the probe is a white control button. Pushing this button automatically records the snow-depth measurement, storing it in a data box that's housed in a small backpack. The MagnaProbe was invented by two scientists, Jon Holmgren and Dr. Matthew Stur of Snow-Hydro. It consists of a rod that's approximately 1.5 meters in length. At the end of the probe is a white basket that rides on the top of the snowpack. At the top of the probe is a white control button. Pushing this button automatically records the snow-depth measurement, storing it in a data box that's housed in a small backpack. The MagnaProbe was invented by two scientists, Jon Holmgren and Dr. Matthew Stur of Snow-Hydro. It consists of a rod that's approximately 1.5 meters in length. At the end of the probe is a white basket that rides on the top of the snowpack. At the top of the probe is a white control button. Pushing this button automatically records the snow-depth measurement, storing it in a data box that's housed in a small backpack.
in scheme: instruments

Probes
type: Concept